{"text_format":"1","workbook":"xlsx","n_sheets":7,"sheets":["Return Form","Instructions","Due Date","Discount","PenaltyOver5","PenaltyUnder5","Interest"],"not_rendered":{"charts":0,"images":0,"macros":1,"external_links":0,"defined_names":0,"comments":0,"pivot_tables":0},"unopened":[],"bounds":{"document_bytes":16777216,"sheet_cells":100000,"rows_first":2000,"rows_last":500,"rows_between":2000,"halvings":0,"cell_chars":16384,"cell_head_chars":4096},"cells_cut":0,"cells_raw":0,"read":"whole","date_system":"1900"}

{"sheet":"Return Form","index":0,"n_rows":175,"n_cols":20,"rows_kept":175,"cut":false,"hidden":false,"merged":[[5,1,5,4],[4,10,4,13],[0,0,0,14],[170,0,170,2],[170,6,170,8],[170,12,170,14],[8,0,9,14],[3,1,3,4],[4,1,4,4],[2,1,2,4],[2,10,2,13],[3,10,3,13]]}
["Important: This return must be filed and taxes paid by the 20th day of the month following the month in which the tax is collected."]
[]
["For Month Ending:",null,null,null,null,null,null,null,null,"Date Filed:"]
["Due No Later Than:",{"$f":"IF(ISBLANK(B3),\"\",VLOOKUP(EOMONTH(B3,0),'Due Date'!A1:B144,2))","v":""},null,null,null,null,null,null,null,"Phone:"]
["Business Name:",null,null,null,null,null,null,null,null,"City Tax No:"]
["Mailing Address:"]
[]
[]
["This return includes all excise taxes collected for the City of Savannah on charges to the public for lodging accommodations during the above stated month. Please refer to the instructions sheet for more information regarding this electronic document."]
[]
[]
[null,null,1,2,3,null,4,5,6,7,8,9,10,11,12]
["Property Address","STVR Number","Total Charges Lod./Mtg.","Third Party Stay Deductions","Over 30 Days Deductions","Meeting Rooms Deductions","Government Deductions","Fire/ Casualty Deductions","Net Taxable Lodging","City Tax Lodging","3% Discount if not delinquent","Tax After Discount (if applies)","Late Payment Penalty","Late Interest if applies","TOTAL AMOUNT DUE","Under 5","MAX","Over 5","MAX","INT"]
["123 Main Street NW Suite",1234567,100,2,3,4,5,6,{"$f":"C14-SUM(D14:H14)","v":80},{"$f":"I14*0.08","v":6.4},{"$f":"ROUND(J14*$A$175,2)","v":{"$error":"#N/A"}},{"$f":"J14-K14","v":{"$error":"#N/A"}},{"$f":"IF(ISBLANK(C14),0,IF($R$14<P14,Q14,S14))","v":{"$error":"#N/A"}},{"$f":"IF(R14+T14<0,0,T14)","v":0},{"$f":"SUM(L14:N14)","v":{"$error":"#N/A"}},{"$f":"IF(ISBLANK($B$3),0,IF($B$4>=$K$3,0,SUM(OFFSET(PenaltyUnder5!$B$1,MATCH($B$4,PenaltyUnder5!$A$1:$A$144),1):OFFSET(PenaltyUnder5!$A$1,MATCH($A$174,PenaltyUnder5!$A$1:$A$144)-1,1))))","v":0},{"$f":"IF(P14<=25,P14,25)","v":0},{"$f":"IF(ISBLANK($B$3),0,IF($B$4>=$K$3,0,SUM(OFFSET(PenaltyOver5!$B$1,MATCH($B$4,PenaltyOver5!$A$1:$A$144),1):OFFSET(PenaltyOver5!$A$1,MATCH($A$174,PenaltyOver5!$A$1:$A$144)-1,1))*L14))","v":0},{"$f":"IF(R14<=L14*0.25,R14,L14*0.25)","v":{"$error":"#N/A"}},{"$f":"IF(ISBLANK($B$3),0,IF($B$4>=$K$3,0,SUM(OFFSET(Interest!$B$1,MATCH($B$4,Interest!$A$1:$A$144),1):OFFSET(Interest!$A$1,MATCH($A$174,Interest!$A$1:$A$144)-1,1))*L14))","v":0}]
[null,null,null,0,0,0,0,0,{"$f":"C15-SUM(D15:H15)","v":0},{"$f":"I15*0.08","v":0},{"$f":"ROUND(J15*$A$175,2)","v":{"$error":"#N/A"}},{"$f":"J15-K15","v":{"$error":"#N/A"}},{"$f":"IF(ISBLANK(C15),0,IF($R$14<P15,Q15,S15))","v":0},{"$f":"IF(R15+T15<0,0,T15)","v":0},{"$f":"SUM(L15:N15)","v":{"$error":"#N/A"}},{"$f":"IF(ISBLANK($B$3),0,IF($B$4>=$K$3,0,SUM(OFFSET(PenaltyUnder5!$B$1,MATCH($B$4,PenaltyUnder5!$A$1:$A$144),1):OFFSET(PenaltyUnder5!$A$1,MATCH($A$174,PenaltyUnder5!$A$1:$A$144)-1,1))))","v":0},{"$f":"IF(P15<=25,P15,25)","v":0},{"$f":"IF(ISBLANK($B$3),0,IF($B$4>=$K$3,0,SUM(OFFSET(PenaltyOver5!$B$1,MATCH($B$4,PenaltyOver5!$A$1:$A$144),1):OFFSET(PenaltyOver5!$A$1,MATCH($A$174,PenaltyOver5!$A$1:$A$144)-1,1))*L15))","v":0},{"$f":"IF(R15<=L15*0.25,R15,L15*0.25)","v":{"$error":"#N/A"}},{"$f":"IF(ISBLANK($B$3),0,IF($B$4>=$K$3,0,SUM(OFFSET(Interest!$B$1,MATCH($B$4,Interest!$A$1:$A$144),1):OFFSET(Interest!$A$1,MATCH($A$174,Interest!$A$1:$A$144)-1,1))*L15))","v":0}]
[null,null,null,0,0,0,0,0,0,0,{"$error":"#N/A"},{"$error":"#N/A"},0,0,{"$error":"#N/A"},{"$f":"IF(ISBLANK($B$3),0,IF($B$4>=$K$3,0,SUM(OFFSET(PenaltyUnder5!$B$1,MATCH($B$4,PenaltyUnder5!$A$1:$A$144),1):OFFSET(PenaltyUnder5!$A$1,MATCH($A$174,PenaltyUnder5!$A$1:$A$144)-1,1))))","v":0},0,{"$f":"IF(ISBLANK($B$3),0,IF($B$4>=$K$3,0,SUM(OFFSET(PenaltyOver5!$B$1,MATCH($B$4,PenaltyOver5!$A$1:$A$144),1):OFFSET(PenaltyOver5!$A$1,MATCH($A$174,PenaltyOver5!$A$1:$A$144)-1,1))*L16))","v":0},{"$error":"#N/A"},{"$f":"IF(ISBLANK($B$3),0,IF($B$4>=$K$3,0,SUM(OFFSET(Interest!$B$1,MATCH($B$4,Interest!$A$1:$A$144),1):OFFSET(Interest!$A$1,MATCH($A$174,Interest!$A$1:$A$144)-1,1))*L16))","v":0}]
[null,null,null,0,0,0,0,0,0,0,{"$error":"#N/A"},{"$error":"#N/A"},0,0,{"$error":"#N/A"},{"$f":"IF(ISBLANK($B$3),0,IF($B$4>=$K$3,0,SUM(OFFSET(PenaltyUnder5!$B$1,MATCH($B$4,PenaltyUnder5!$A$1:$A$144),1):OFFSET(PenaltyUnder5!$A$1,MATCH($A$174,PenaltyUnder5!$A$1:$A$144)-1,1))))","v":0},0,{"$f":"IF(ISBLANK($B$3),0,IF($B$4>=$K$3,0,SUM(OFFSET(PenaltyOver5!$B$1,MATCH($B$4,PenaltyOver5!$A$1:$A$144),1):OFFSET(PenaltyOver5!$A$1,MATCH($A$174,PenaltyOver5!$A$1:$A$144)-1,1))*L17))","v":0},{"$error":"#N/A"},{"$f":"IF(ISBLANK($B$3),0,IF($B$4>=$K$3,0,SUM(OFFSET(Interest!$B$1,MATCH($B$4,Interest!$A$1:$A$144),1):OFFSET(Interest!$A$1,MATCH($A$174,Interest!$A$1:$A$144)-1,1))*L17))","v":0}]
[null,null,null,0,0,0,0,0,0,0,{"$error":"#N/A"},{"$error":"#N/A"},0,0,{"$error":"#N/A"},{"$f":"IF(ISBLANK($B$3),0,IF($B$4>=$K$3,0,SUM(OFFSET(PenaltyUnder5!$B$1,MATCH($B$4,PenaltyUnder5!$A$1:$A$144),1):OFFSET(PenaltyUnder5!$A$1,MATCH($A$174,PenaltyUnder5!$A$1:$A$144)-1,1))))","v":0},0,{"$f":"IF(ISBLANK($B$3),0,IF($B$4>=$K$3,0,SUM(OFFSET(PenaltyOver5!$B$1,MATCH($B$4,PenaltyOver5!$A$1:$A$144),1):OFFSET(PenaltyOver5!$A$1,MATCH($A$174,PenaltyOver5!$A$1:$A$144)-1,1))*L18))","v":0},{"$error":"#N/A"},{"$f":"IF(ISBLANK($B$3),0,IF($B$4>=$K$3,0,SUM(OFFSET(Interest!$B$1,MATCH($B$4,Interest!$A$1:$A$144),1):OFFSET(Interest!$A$1,MATCH($A$174,Interest!$A$1:$A$144)-1,1))*L18))","v":0}]
[null,null,null,0,0,0,0,0,0,0,{"$error":"#N/A"},{"$f":"J19-K19","v":{"$error":"#N/A"}},{"$f":"IF(ISBLANK(C19),0,IF($R$14<P19,Q19,S19))","v":0},{"$f":"IF(R19+T19<0,0,T19)","v":0},{"$f":"SUM(L19:N19)","v":{"$error":"#N/A"}},{"$f":"IF(ISBLANK($B$3),0,IF($B$4>=$K$3,0,SUM(OFFSET(PenaltyUnder5!$B$1,MATCH($B$4,PenaltyUnder5!$A$1:$A$144),1):OFFSET(PenaltyUnder5!$A$1,MATCH($A$174,PenaltyUnder5!$A$1:$A$144)-1,1))))","v":0},0,{"$f":"IF(ISBLANK($B$3),0,IF($B$4>=$K$3,0,SUM(OFFSET(PenaltyOver5!$B$1,MATCH($B$4,PenaltyOver5!$A$1:$A$144),1):OFFSET(PenaltyOver5!$A$1,MATCH($A$174,PenaltyOver5!$A$1:$A$144)-1,1))*L19))","v":0},{"$error":"#N/A"},{"$f":"IF(ISBLANK($B$3),0,IF($B$4>=$K$3,0,SUM(OFFSET(Interest!$B$1,MATCH($B$4,Interest!$A$1:$A$144),1):OFFSET(Interest!$A$1,MATCH($A$174,Interest!$A$1:$A$144)-1,1))*L19))","v":0}]
[null,null,null,0,0,0,0,0,0,0,{"$error":"#N/A"},{"$error":"#N/A"},0,0,{"$error":"#N/A"},{"$f":"IF(ISBLANK($B$3),0,IF($B$4>=$K$3,0,SUM(OFFSET(PenaltyUnder5!$B$1,MATCH($B$4,PenaltyUnder5!$A$1:$A$144),1):OFFSET(PenaltyUnder5!$A$1,MATCH($A$174,PenaltyUnder5!$A$1:$A$144)-1,1))))","v":0},0,{"$f":"IF(ISBLANK($B$3),0,IF($B$4>=$K$3,0,SUM(OFFSET(PenaltyOver5!$B$1,MATCH($B$4,PenaltyOver5!$A$1:$A$144),1):OFFSET(PenaltyOver5!$A$1,MATCH($A$174,PenaltyOver5!$A$1:$A$144)-1,1))*L20))","v":0},{"$error":"#N/A"},{"$f":"IF(ISBLANK($B$3),0,IF($B$4>=$K$3,0,SUM(OFFSET(Interest!$B$1,MATCH($B$4,Interest!$A$1:$A$144),1):OFFSET(Interest!$A$1,MATCH($A$174,Interest!$A$1:$A$144)-1,1))*L20))","v":0}]
[null,null,null,0,0,0,0,0,0,0,{"$error":"#N/A"},{"$error":"#N/A"},0,0,{"$error":"#N/A"},{"$f":"IF(ISBLANK($B$3),0,IF($B$4>=$K$3,0,SUM(OFFSET(PenaltyUnder5!$B$1,MATCH($B$4,PenaltyUnder5!$A$1:$A$144),1):OFFSET(PenaltyUnder5!$A$1,MATCH($A$174,PenaltyUnder5!$A$1:$A$144)-1,1))))","v":0},0,{"$f":"IF(ISBLANK($B$3),0,IF($B$4>=$K$3,0,SUM(OFFSET(PenaltyOver5!$B$1,MATCH($B$4,PenaltyOver5!$A$1:$A$144),1):OFFSET(PenaltyOver5!$A$1,MATCH($A$174,PenaltyOver5!$A$1:$A$144)-1,1))*L21))","v":0},{"$error":"#N/A"},{"$f":"IF(ISBLANK($B$3),0,IF($B$4>=$K$3,0,SUM(OFFSET(Interest!$B$1,MATCH($B$4,Interest!$A$1:$A$144),1):OFFSET(Interest!$A$1,MATCH($A$174,Interest!$A$1:$A$144)-1,1))*L21))","v":0}]
[null,null,null,0,0,0,0,0,0,0,{"$error":"#N/A"},{"$error":"#N/A"},0,0,{"$error":"#N/A"},{"$f":"IF(ISBLANK($B$3),0,IF($B$4>=$K$3,0,SUM(OFFSET(PenaltyUnder5!$B$1,MATCH($B$4,PenaltyUnder5!$A$1:$A$144),1):OFFSET(PenaltyUnder5!$A$1,MATCH($A$174,PenaltyUnder5!$A$1:$A$144)-1,1))))","v":0},0,{"$f":"IF(ISBLANK($B$3),0,IF($B$4>=$K$3,0,SUM(OFFSET(PenaltyOver5!$B$1,MATCH($B$4,PenaltyOver5!$A$1:$A$144),1):OFFSET(PenaltyOver5!$A$1,MATCH($A$174,PenaltyOver5!$A$1:$A$144)-1,1))*L22))","v":0},{"$error":"#N/A"},{"$f":"IF(ISBLANK($B$3),0,IF($B$4>=$K$3,0,SUM(OFFSET(Interest!$B$1,MATCH($B$4,Interest!$A$1:$A$144),1):OFFSET(Interest!$A$1,MATCH($A$174,Interest!$A$1:$A$144)-1,1))*L22))","v":0}]
[null,null,null,0,0,0,0,0,0,0,{"$error":"#N/A"},{"$error":"#N/A"},0,0,{"$error":"#N/A"},{"$f":"IF(ISBLANK($B$3),0,IF($B$4>=$K$3,0,SUM(OFFSET(PenaltyUnder5!$B$1,MATCH($B$4,PenaltyUnder5!$A$1:$A$144),1):OFFSET(PenaltyUnder5!$A$1,MATCH($A$174,PenaltyUnder5!$A$1:$A$144)-1,1))))","v":0},0,{"$f":"IF(ISBLANK($B$3),0,IF($B$4>=$K$3,0,SUM(OFFSET(PenaltyOver5!$B$1,MATCH($B$4,PenaltyOver5!$A$1:$A$144),1):OFFSET(PenaltyOver5!$A$1,MATCH($A$174,PenaltyOver5!$A$1:$A$144)-1,1))*L23))","v":0},{"$error":"#N/A"},{"$f":"IF(ISBLANK($B$3),0,IF($B$4>=$K$3,0,SUM(OFFSET(Interest!$B$1,MATCH($B$4,Interest!$A$1:$A$144),1):OFFSET(Interest!$A$1,MATCH($A$174,Interest!$A$1:$A$144)-1,1))*L23))","v":0}]
[null,null,null,0,0,0,0,0,0,0,{"$error":"#N/A"},{"$error":"#N/A"},0,0,{"$error":"#N/A"},{"$f":"IF(ISBLANK($B$3),0,IF($B$4>=$K$3,0,SUM(OFFSET(PenaltyUnder5!$B$1,MATCH($B$4,PenaltyUnder5!$A$1:$A$144),1):OFFSET(PenaltyUnder5!$A$1,MATCH($A$174,PenaltyUnder5!$A$1:$A$144)-1,1))))","v":0},0,{"$f":"IF(ISBLANK($B$3),0,IF($B$4>=$K$3,0,SUM(OFFSET(PenaltyOver5!$B$1,MATCH($B$4,PenaltyOver5!$A$1:$A$144),1):OFFSET(PenaltyOver5!$A$1,MATCH($A$174,PenaltyOver5!$A$1:$A$144)-1,1))*L24))","v":0},{"$error":"#N/A"},{"$f":"IF(ISBLANK($B$3),0,IF($B$4>=$K$3,0,SUM(OFFSET(Interest!$B$1,MATCH($B$4,Interest!$A$1:$A$144),1):OFFSET(Interest!$A$1,MATCH($A$174,Interest!$A$1:$A$144)-1,1))*L24))","v":0}]
[null,null,null,0,0,0,0,0,0,0,{"$error":"#N/A"},{"$error":"#N/A"},0,0,{"$error":"#N/A"},{"$f":"IF(ISBLANK($B$3),0,IF($B$4>=$K$3,0,SUM(OFFSET(PenaltyUnder5!$B$1,MATCH($B$4,PenaltyUnder5!$A$1:$A$144),1):OFFSET(PenaltyUnder5!$A$1,MATCH($A$174,PenaltyUnder5!$A$1:$A$144)-1,1))))","v":0},0,{"$f":"IF(ISBLANK($B$3),0,IF($B$4>=$K$3,0,SUM(OFFSET(PenaltyOver5!$B$1,MATCH($B$4,PenaltyOver5!$A$1:$A$144),1):OFFSET(PenaltyOver5!$A$1,MATCH($A$174,PenaltyOver5!$A$1:$A$144)-1,1))*L25))","v":0},{"$error":"#N/A"},{"$f":"IF(ISBLANK($B$3),0,IF($B$4>=$K$3,0,SUM(OFFSET(Interest!$B$1,MATCH($B$4,Interest!$A$1:$A$144),1):OFFSET(Interest!$A$1,MATCH($A$174,Interest!$A$1:$A$144)-1,1))*L25))","v":0}]
[null,null,null,0,0,0,0,0,0,0,{"$error":"#N/A"},{"$error":"#N/A"},0,0,{"$error":"#N/A"},{"$f":"IF(ISBLANK($B$3),0,IF($B$4>=$K$3,0,SUM(OFFSET(PenaltyUnder5!$B$1,MATCH($B$4,PenaltyUnder5!$A$1:$A$144),1):OFFSET(PenaltyUnder5!$A$1,MATCH($A$174,PenaltyUnder5!$A$1:$A$144)-1,1))))","v":0},0,{"$f":"IF(ISBLANK($B$3),0,IF($B$4>=$K$3,0,SUM(OFFSET(PenaltyOver5!$B$1,MATCH($B$4,PenaltyOver5!$A$1:$A$144),1):OFFSET(PenaltyOver5!$A$1,MATCH($A$174,PenaltyOver5!$A$1:$A$144)-1,1))*L26))","v":0},{"$error":"#N/A"},{"$f":"IF(ISBLANK($B$3),0,IF($B$4>=$K$3,0,SUM(OFFSET(Interest!$B$1,MATCH($B$4,Interest!$A$1:$A$144),1):OFFSET(Interest!$A$1,MATCH($A$174,Interest!$A$1:$A$144)-1,1))*L26))","v":0}]
[null,null,null,0,0,0,0,0,0,0,{"$error":"#N/A"},{"$error":"#N/A"},0,0,{"$error":"#N/A"},{"$f":"IF(ISBLANK($B$3),0,IF($B$4>=$K$3,0,SUM(OFFSET(PenaltyUnder5!$B$1,MATCH($B$4,PenaltyUnder5!$A$1:$A$144),1):OFFSET(PenaltyUnder5!$A$1,MATCH($A$174,PenaltyUnder5!$A$1:$A$144)-1,1))))","v":0},0,{"$f":"IF(ISBLANK($B$3),0,IF($B$4>=$K$3,0,SUM(OFFSET(PenaltyOver5!$B$1,MATCH($B$4,PenaltyOver5!$A$1:$A$144),1):OFFSET(PenaltyOver5!$A$1,MATCH($A$174,PenaltyOver5!$A$1:$A$144)-1,1))*L27))","v":0},{"$error":"#N/A"},{"$f":"IF(ISBLANK($B$3),0,IF($B$4>=$K$3,0,SUM(OFFSET(Interest!$B$1,MATCH($B$4,Interest!$A$1:$A$144),1):OFFSET(Interest!$A$1,MATCH($A$174,Interest!$A$1:$A$144)-1,1))*L27))","v":0}]
[null,null,null,0,0,0,0,0,0,0,{"$error":"#N/A"},{"$f":"J28-K28","v":{"$error":"#N/A"}},{"$f":"IF(ISBLANK(C28),0,IF($R$14<P28,Q28,S28))","v":0},{"$f":"IF(R28+T28<0,0,T28)","v":0},{"$f":"SUM(L28:N28)","v":{"$error":"#N/A"}},{"$f":"IF(ISBLANK($B$3),0,IF($B$4>=$K$3,0,SUM(OFFSET(PenaltyUnder5!$B$1,MATCH($B$4,PenaltyUnder5!$A$1:$A$144),1):OFFSET(PenaltyUnder5!$A$1,MATCH($A$174,PenaltyUnder5!$A$1:$A$144)-1,1))))","v":0},0,{"$f":"IF(ISBLANK($B$3),0,IF($B$4>=$K$3,0,SUM(OFFSET(PenaltyOver5!$B$1,MATCH($B$4,PenaltyOver5!$A$1:$A$144),1):OFFSET(PenaltyOver5!$A$1,MATCH($A$174,PenaltyOver5!$A$1:$A$144)-1,1))*L28))","v":0},{"$error":"#N/A"},{"$f":"IF(ISBLANK($B$3),0,IF($B$4>=$K$3,0,SUM(OFFSET(Interest!$B$1,MATCH($B$4,Interest!$A$1:$A$144),1):OFFSET(Interest!$A$1,MATCH($A$174,Interest!$A$1:$A$144)-1,1))*L28))","v":0}]
[null,null,null,0,0,0,0,0,0,0,{"$error":"#N/A"},{"$error":"#N/A"},0,0,{"$error":"#N/A"},{"$f":"IF(ISBLANK($B$3),0,IF($B$4>=$K$3,0,SUM(OFFSET(PenaltyUnder5!$B$1,MATCH($B$4,PenaltyUnder5!$A$1:$A$144),1):OFFSET(PenaltyUnder5!$A$1,MATCH($A$174,PenaltyUnder5!$A$1:$A$144)-1,1))))","v":0},0,{"$f":"IF(ISBLANK($B$3),0,IF($B$4>=$K$3,0,SUM(OFFSET(PenaltyOver5!$B$1,MATCH($B$4,PenaltyOver5!$A$1:$A$144),1):OFFSET(PenaltyOver5!$A$1,MATCH($A$174,PenaltyOver5!$A$1:$A$144)-1,1))*L29))","v":0},{"$error":"#N/A"},{"$f":"IF(ISBLANK($B$3),0,IF($B$4>=$K$3,0,SUM(OFFSET(Interest!$B$1,MATCH($B$4,Interest!$A$1:$A$144),1):OFFSET(Interest!$A$1,MATCH($A$174,Interest!$A$1:$A$144)-1,1))*L29))","v":0}]
[null,null,null,0,0,0,0,0,0,0,{"$error":"#N/A"},{"$error":"#N/A"},0,0,{"$error":"#N/A"},{"$f":"IF(ISBLANK($B$3),0,IF($B$4>=$K$3,0,SUM(OFFSET(PenaltyUnder5!$B$1,MATCH($B$4,PenaltyUnder5!$A$1:$A$144),1):OFFSET(PenaltyUnder5!$A$1,MATCH($A$174,PenaltyUnder5!$A$1:$A$144)-1,1))))","v":0},0,{"$f":"IF(ISBLANK($B$3),0,IF($B$4>=$K$3,0,SUM(OFFSET(PenaltyOver5!$B$1,MATCH($B$4,PenaltyOver5!$A$1:$A$144),1):OFFSET(PenaltyOver5!$A$1,MATCH($A$174,PenaltyOver5!$A$1:$A$144)-1,1))*L30))","v":0},{"$error":"#N/A"},{"$f":"IF(ISBLANK($B$3),0,IF($B$4>=$K$3,0,SUM(OFFSET(Interest!$B$1,MATCH($B$4,Interest!$A$1:$A$144),1):OFFSET(Interest!$A$1,MATCH($A$174,Interest!$A$1:$A$144)-1,1))*L30))","v":0}]
{"$rows_left_out":146}
{"sheet":"Instructions","index":1,"n_rows":22,"n_cols":2,"rows_kept":22,"cut":false,"hidden":false,"merged":[[2,1,2,12],[21,1,21,12],[13,1,13,12],[3,1,3,12],[4,1,5,12],[6,1,6,12],[10,1,10,12],[11,1,11,12],[12,1,12,12],[7,1,8,12],[9,1,9,12],[14,1,17,12],[18,1,20,12]]}
[]
[]
["COLUMN","DESCRIPTION"]
[1,"Total Charges for Lodgings & Meeting Rooms"]
[2,"Deduct charges for lodgings furnished for a period of more than 30 consecutive days. The tax is due for the first 30 days; do not deduct charges for lodging for days 1-30; deduct beginning on the 31st day."]
[]
[3,"Deduct charges for meeting rooms."]
[4,"Deduct charges for lodgings furnished to Federal, Georgia state or local government officials or employees when traveling on official business."]
[]
[5,"Deduct charges for lodgings furnished as the result of destruction of the occupant’s residence by fire or other casualty."]
[6,"Net taxable charges for lodging accommodations."]
[7,"City excise tax – 8% of Line 6."]
[8,"Deduct 3% of Line 7, provided the amount due is not delinquent when paid."]
[9,"Net tax payable to City of Savannah."]
[10,"Penalty for late payment: If return is postmarked after the 20th of the month in which payment is due, add 5% of Line 9 or $5.00, whichever is greater if the failure is not more than 30 days. An additional penalty of five percent or $5.00, whichever is greater, shall be charged for each additional 30 days or portion thereof during which the failure continues. The penalty for any single violation shall not exceed 25 percent or $25.00 in the aggregate, whichever is greater."]
[]
[]
[]
[11,"Interest for late payment of the tax due shall be charged in addition to the penalties levied in Line 10 at an\nannual rate equal to the Federal Reserve prime rate plus 3 percent from the date the tax is due until the date the tax is paid.                    This rate is subject to change annually."]
[]
[]
[12,"TOTAL AMOUNT REPORTED AND REMITTED TO THE CITY."]

{"sheet":"Due Date","index":2,"n_rows":144,"n_cols":2,"rows_kept":144,"cut":false,"hidden":true,"merged":[]}
["2015-01-31","2015-02-20"]
["2015-02-28","2015-03-20"]
["2015-03-31","2015-04-20"]
["2015-04-30","2015-05-20"]
["2015-05-31","2015-06-20"]
["2015-06-30","2015-07-20"]
["2015-07-31","2015-08-20"]
["2015-08-31","2015-09-20"]
["2015-09-30","2015-10-20"]
["2015-10-31","2015-11-20"]
["2015-11-30","2015-12-20"]
["2015-12-31","2016-01-20"]
["2016-01-31","2016-02-20"]
["2016-02-29","2016-03-20"]
["2016-03-31","2016-04-20"]
["2016-04-30","2016-05-20"]
["2016-05-31","2016-06-20"]
["2016-06-30","2016-07-20"]
["2016-07-31","2016-08-20"]
["2016-08-31","2016-09-20"]
["2016-09-30","2016-10-20"]
["2016-10-31","2016-11-20"]
["2016-11-30","2016-12-20"]
["2016-12-31","2017-01-20"]
["2017-01-31","2017-02-20"]
["2017-02-28","2017-03-20"]
["2017-03-31","2017-04-20"]
["2017-04-30","2017-05-20"]
["2017-05-31","2017-06-20"]
["2017-06-30","2017-07-20"]
{"$rows_left_out":115}
{"sheet":"Discount","index":3,"n_rows":146,"n_cols":22,"rows_kept":146,"cut":false,"hidden":true,"merged":[]}
[null,1,2,3,4,5,6,7,8,9,10,11,12,13,14,15,16,17,18,19,20,21]
["2015-01-01",0.03,0.03,0.03,0.03,0.03,0.03,0.03,0.03,0.03,0.03,0.03,0.03,0.03,0.03,0.03,0.03,0.03,0.03,0.03,0.03,0]
["2015-02-01",0.03,0.03,0.03,0.03,0.03,0.03,0.03,0.03,0.03,0.03,0.03,0.03,0.03,0.03,0.03,0.03,0.03,0.03,0.03,0.03,0]
["2015-03-01",0.03,0.03,0.03,0.03,0.03,0.03,0.03,0.03,0.03,0.03,0.03,0.03,0.03,0.03,0.03,0.03,0.03,0.03,0.03,0.03,0]
["2015-04-01",0.03,0.03,0.03,0.03,0.03,0.03,0.03,0.03,0.03,0.03,0.03,0.03,0.03,0.03,0.03,0.03,0.03,0.03,0.03,0.03,0]
["2015-05-01",0.03,0.03,0.03,0.03,0.03,0.03,0.03,0.03,0.03,0.03,0.03,0.03,0.03,0.03,0.03,0.03,0.03,0.03,0.03,0.03,0]
["2015-06-01",0.03,0.03,0.03,0.03,0.03,0.03,0.03,0.03,0.03,0.03,0.03,0.03,0.03,0.03,0.03,0.03,0.03,0.03,0.03,0.03,0]
["2015-07-01",0.03,0.03,0.03,0.03,0.03,0.03,0.03,0.03,0.03,0.03,0.03,0.03,0.03,0.03,0.03,0.03,0.03,0.03,0.03,0.03,0]
["2015-08-01",0.03,0.03,0.03,0.03,0.03,0.03,0.03,0.03,0.03,0.03,0.03,0.03,0.03,0.03,0.03,0.03,0.03,0.03,0.03,0.03,0]
["2015-09-01",0.03,0.03,0.03,0.03,0.03,0.03,0.03,0.03,0.03,0.03,0.03,0.03,0.03,0.03,0.03,0.03,0.03,0.03,0.03,0.03,0]
["2015-10-01",0.03,0.03,0.03,0.03,0.03,0.03,0.03,0.03,0.03,0.03,0.03,0.03,0.03,0.03,0.03,0.03,0.03,0.03,0.03,0.03,0]
["2015-11-01",0.03,0.03,0.03,0.03,0.03,0.03,0.03,0.03,0.03,0.03,0.03,0.03,0.03,0.03,0.03,0.03,0.03,0.03,0.03,0.03,0]
["2015-12-01",0.03,0.03,0.03,0.03,0.03,0.03,0.03,0.03,0.03,0.03,0.03,0.03,0.03,0.03,0.03,0.03,0.03,0.03,0.03,0.03,0]
["2016-01-01",0.03,0.03,0.03,0.03,0.03,0.03,0.03,0.03,0.03,0.03,0.03,0.03,0.03,0.03,0.03,0.03,0.03,0.03,0.03,0.03,0]
["2016-02-01",0.03,0.03,0.03,0.03,0.03,0.03,0.03,0.03,0.03,0.03,0.03,0.03,0.03,0.03,0.03,0.03,0.03,0.03,0.03,0.03,0]
["2016-03-01",0.03,0.03,0.03,0.03,0.03,0.03,0.03,0.03,0.03,0.03,0.03,0.03,0.03,0.03,0.03,0.03,0.03,0.03,0.03,0.03,0]
["2016-04-01",0.03,0.03,0.03,0.03,0.03,0.03,0.03,0.03,0.03,0.03,0.03,0.03,0.03,0.03,0.03,0.03,0.03,0.03,0.03,0.03,0]
["2016-05-01",0.03,0.03,0.03,0.03,0.03,0.03,0.03,0.03,0.03,0.03,0.03,0.03,0.03,0.03,0.03,0.03,0.03,0.03,0.03,0.03,0]
["2016-06-01",0.03,0.03,0.03,0.03,0.03,0.03,0.03,0.03,0.03,0.03,0.03,0.03,0.03,0.03,0.03,0.03,0.03,0.03,0.03,0.03,0]
["2016-07-01",0.03,0.03,0.03,0.03,0.03,0.03,0.03,0.03,0.03,0.03,0.03,0.03,0.03,0.03,0.03,0.03,0.03,0.03,0.03,0.03,0]
["2016-08-01",0.03,0.03,0.03,0.03,0.03,0.03,0.03,0.03,0.03,0.03,0.03,0.03,0.03,0.03,0.03,0.03,0.03,0.03,0.03,0.03,0]
["2016-09-01",0.03,0.03,0.03,0.03,0.03,0.03,0.03,0.03,0.03,0.03,0.03,0.03,0.03,0.03,0.03,0.03,0.03,0.03,0.03,0.03,0]
["2016-10-01",0.03,0.03,0.03,0.03,0.03,0.03,0.03,0.03,0.03,0.03,0.03,0.03,0.03,0.03,0.03,0.03,0.03,0.03,0.03,0.03,0]
["2016-11-01",0.03,0.03,0.03,0.03,0.03,0.03,0.03,0.03,0.03,0.03,0.03,0.03,0.03,0.03,0.03,0.03,0.03,0.03,0.03,0.03,0]
["2016-12-01",0.03,0.03,0.03,0.03,0.03,0.03,0.03,0.03,0.03,0.03,0.03,0.03,0.03,0.03,0.03,0.03,0.03,0.03,0.03,0.03,0]
["2017-01-01",0.03,0.03,0.03,0.03,0.03,0.03,0.03,0.03,0.03,0.03,0.03,0.03,0.03,0.03,0.03,0.03,0.03,0.03,0.03,0.03,0]
["2017-02-01",0.03,0.03,0.03,0.03,0.03,0.03,0.03,0.03,0.03,0.03,0.03,0.03,0.03,0.03,0.03,0.03,0.03,0.03,0.03,0.03,0]
["2017-03-01",0.03,0.03,0.03,0.03,0.03,0.03,0.03,0.03,0.03,0.03,0.03,0.03,0.03,0.03,0.03,0.03,0.03,0.03,0.03,0.03,0]
["2017-04-01",0.03,0.03,0.03,0.03,0.03,0.03,0.03,0.03,0.03,0.03,0.03,0.03,0.03,0.03,0.03,0.03,0.03,0.03,0.03,0.03,0]
["2017-05-01",0.03,0.03,0.03,0.03,0.03,0.03,0.03,0.03,0.03,0.03,0.03,0.03,0.03,0.03,0.03,0.03,0.03,0.03,0.03,0.03,0]
{"$rows_left_out":117}
{"sheet":"PenaltyOver5","index":4,"n_rows":144,"n_cols":2,"rows_kept":144,"cut":false,"hidden":true,"merged":[]}
["2015-01-31",0.05]
["2015-02-28",0.05]
["2015-03-31",0.05]
["2015-04-30",0.05]
["2015-05-31",0.05]
["2015-06-30",0.05]
["2015-07-31",0.05]
["2015-08-31",0.05]
["2015-09-30",0.05]
["2015-10-31",0.05]
["2015-11-30",0.05]
["2015-12-31",0.05]
["2016-01-31",0.05]
["2016-02-29",0.05]
["2016-03-31",0.05]
["2016-04-30",0.05]
["2016-05-31",0.05]
["2016-06-30",0.05]
["2016-07-31",0.05]
["2016-08-31",0.05]
["2016-09-30",0.05]
["2016-10-31",0.05]
["2016-11-30",0.05]
["2016-12-31",0.05]
["2017-01-31",0.05]
["2017-02-28",0.05]
["2017-03-31",0.05]
["2017-04-30",0.05]
["2017-05-31",0.05]
["2017-06-30",0.05]
{"$rows_left_out":115}
{"sheet":"PenaltyUnder5","index":5,"n_rows":144,"n_cols":2,"rows_kept":144,"cut":false,"hidden":true,"merged":[]}
["2015-01-31",5]
["2015-02-28",5]
["2015-03-31",5]
["2015-04-30",5]
["2015-05-31",5]
["2015-06-30",5]
["2015-07-31",5]
["2015-08-31",5]
["2015-09-30",5]
["2015-10-31",5]
["2015-11-30",5]
["2015-12-31",5]
["2016-01-31",5]
["2016-02-29",5]
["2016-03-31",5]
["2016-04-30",5]
["2016-05-31",5]
["2016-06-30",5]
["2016-07-31",5]
["2016-08-31",5]
["2016-09-30",5]
["2016-10-31",5]
["2016-11-30",5]
["2016-12-31",5]
["2017-01-31",5]
["2017-02-28",5]
["2017-03-31",5]
["2017-04-30",5]
["2017-05-31",5]
["2017-06-30",5]
{"$rows_left_out":115}
{"sheet":"Interest","index":6,"n_rows":144,"n_cols":2,"rows_kept":144,"cut":false,"hidden":true,"merged":[]}
["2015-01-31",0.01]
["2015-02-28",0.01]
["2015-03-31",0.01]
["2015-04-30",0.01]
["2015-05-31",0.01]
["2015-06-30",0.01]
["2015-07-31",0.01]
["2015-08-31",0.01]
["2015-09-30",0.01]
["2015-10-31",0.01]
["2015-11-30",0.01]
["2015-12-31",0.01]
["2016-01-31",0.01]
["2016-02-29",0.01]
["2016-03-31",0.01]
["2016-04-30",0.01]
["2016-05-31",0.01]
["2016-06-30",0.01]
["2016-07-31",0.01]
["2016-08-31",0.01]
["2016-09-30",0.01]
["2016-10-31",0.01]
["2016-11-30",0.01]
["2016-12-31",0.01]
["2017-01-31",5.6249999999999998E-3]
["2017-02-28",5.6249999999999998E-3]
["2017-03-31",5.6249999999999998E-3]
["2017-04-30",5.6249999999999998E-3]
["2017-05-31",5.6249999999999998E-3]
["2017-06-30",5.6249999999999998E-3]
{"$rows_left_out":114}